Reaction Details
TargetGlutamate receptor ionotropic, NMDA 2D
LigandBDBM50440050
Substrate/Competitorn/a
Meas. Tech.ChEMBL_983749 (CHEMBL2427902)
IC50 1900±n/a nM
Citation Acker, TMKhatri, AVance, KMSlabber, CBacsa, JSnyder, JPTraynelis, SFLiotta, DC Structure-activity relationships and pharmacophore model of a noncompetitive pyrazoline containing class of GluN2C/GluN2D selective antagonists. J Med Chem56:6434-56 (2013) 
 
Glutamate receptor ionotropic, NMDA 2D
Name:Glutamate receptor ionotropic, NMDA 2D
Type:Protein
Mol. Mass.:143129.52
Organism:Rattus norvegicus (Rat)
Description:Q62645
Residue:1323
BDBM50440050
NameBDBM50440050
Synonyms:CHEMBL2425973
TypeSmall organic molecule
Emp. Form.C29H24ClN3O4
Mol. Mass.513.972
SMILESCc1cccc(c1)-c1c(C2=NN(C(C2)c2ccc(Cl)cc2)C(=O)CCC(O)=O)c(=O)[nH]c2ccccc12