Reaction Details
TargetGlutamate receptor ionotropic, NMDA 2C
LigandBDBM50440051
Substrate/Competitorn/a
Meas. Tech.ChEMBL_983748 (CHEMBL2427901)
IC50 2100±n/a nM
Citation Acker, TMKhatri, AVance, KMSlabber, CBacsa, JSnyder, JPTraynelis, SFLiotta, DC Structure-activity relationships and pharmacophore model of a noncompetitive pyrazoline containing class of GluN2C/GluN2D selective antagonists. J Med Chem56:6434-56 (2013) 
 
Glutamate receptor ionotropic, NMDA 2C
Name:Glutamate receptor ionotropic, NMDA 2C
Type:Protein
Mol. Mass.:135305.94
Organism:Rattus norvegicus (Rat)
Description:Q00961
Residue:1237
BDBM50440051
NameBDBM50440051
Synonyms:CHEMBL2425972
TypeSmall organic molecule
Emp. Form.C28H21Cl2N3O4
Mol. Mass.534.39
SMILESOC(=O)CCC(=O)N1N=C(CC1c1ccc(Cl)cc1)c1c(-c2cccc(Cl)c2)c2ccccc2[nH]c1=O