Reaction Details
TargetGlutamate receptor ionotropic, NMDA 2D
LigandBDBM50440065
Substrate/Competitorn/a
Meas. Tech.ChEMBL_983749 (CHEMBL2427902)
IC50 320±n/a nM
Citation Acker, TMKhatri, AVance, KMSlabber, CBacsa, JSnyder, JPTraynelis, SFLiotta, DC Structure-activity relationships and pharmacophore model of a noncompetitive pyrazoline containing class of GluN2C/GluN2D selective antagonists. J Med Chem56:6434-56 (2013) 
 
Glutamate receptor ionotropic, NMDA 2D
Name:Glutamate receptor ionotropic, NMDA 2D
Type:Protein
Mol. Mass.:143129.52
Organism:Rattus norvegicus (Rat)
Description:Q62645
Residue:1323
BDBM50440065
NameBDBM50440065
Synonyms:CHEMBL2426075
TypeSmall organic molecule
Emp. Form.C29H23BrClN3O4
Mol. Mass.592.868
SMILESOC(=O)CCCC(=O)N1N=C(CC1c1ccc(Cl)cc1)c1c(-c2ccc(Br)cc2)c2ccccc2[nH]c1=O