Reaction Details
TargetGlutamate receptor ionotropic, NMDA 2C
LigandBDBM50440076
Substrate/Competitorn/a
Meas. Tech.ChEMBL_983748 (CHEMBL2427901)
IC50 1400±n/a nM
Citation Acker, TMKhatri, AVance, KMSlabber, CBacsa, JSnyder, JPTraynelis, SFLiotta, DC Structure-activity relationships and pharmacophore model of a noncompetitive pyrazoline containing class of GluN2C/GluN2D selective antagonists. J Med Chem56:6434-56 (2013) 
 
Glutamate receptor ionotropic, NMDA 2C
Name:Glutamate receptor ionotropic, NMDA 2C
Type:Protein
Mol. Mass.:135305.94
Organism:Rattus norvegicus (Rat)
Description:Q00961
Residue:1237
BDBM50440076
NameBDBM50440076
Synonyms:CHEMBL2425978
TypeSmall organic molecule
Emp. Form.C28H20Cl2FN3O4
Mol. Mass.552.381
SMILESOC(=O)CCC(=O)N1N=C(CC1c1ccc(Cl)cc1)c1c(-c2ccc(F)c(Cl)c2)c2ccccc2[nH]c1=O