Reaction Details
TargetGlutamate receptor ionotropic, NMDA 2C
LigandBDBM50440078
Substrate/Competitorn/a
Meas. Tech.ChEMBL_983748 (CHEMBL2427901)
IC50 2500±n/a nM
Citation Acker, TMKhatri, AVance, KMSlabber, CBacsa, JSnyder, JPTraynelis, SFLiotta, DC Structure-activity relationships and pharmacophore model of a noncompetitive pyrazoline containing class of GluN2C/GluN2D selective antagonists. J Med Chem56:6434-56 (2013) 
 
Glutamate receptor ionotropic, NMDA 2C
Name:Glutamate receptor ionotropic, NMDA 2C
Type:Protein
Mol. Mass.:135305.94
Organism:Rattus norvegicus (Rat)
Description:Q00961
Residue:1237
BDBM50440078
NameBDBM50440078
Synonyms:CHEMBL2426101
TypeSmall organic molecule
Emp. Form.C29H24ClN3O4
Mol. Mass.513.972
SMILESCc1ccc(cc1)-c1c(C2=NN(C(C2)c2ccc(Cl)cc2)C(=O)CCC(O)=O)c(=O)[nH]c2ccccc12