Reaction Details
TargetGlutamate receptor ionotropic, NMDA 2A
LigandBDBM50440091
Substrate/Competitorn/a
Meas. Tech.ChEMBL_983746 (CHEMBL2427899)
IC50 91000±n/a nM
Citation Acker, TMKhatri, AVance, KMSlabber, CBacsa, JSnyder, JPTraynelis, SFLiotta, DC Structure-activity relationships and pharmacophore model of a noncompetitive pyrazoline containing class of GluN2C/GluN2D selective antagonists. J Med Chem56:6434-56 (2013) 
 
Glutamate receptor ionotropic, NMDA 2A
Name:Glutamate receptor ionotropic, NMDA 2A
Type:Protein
Mol. Mass.:165478.25
Organism:Rattus norvegicus (Rat)
Description:Q00959
Residue:1464
BDBM50440091
NameBDBM50440091
Synonyms:CHEMBL2426086
TypeSmall organic molecule
Emp. Form.C28H21ClN4O6
Mol. Mass.544.943
SMILESOC(=O)CCC(=O)N1N=C(CC1c1ccc(cc1)[N+]([O-])=O)c1c(-c2ccccc2)c2cc(Cl)ccc2[nH]c1=O