Reaction Details
TargetGlutamate receptor ionotropic, NMDA 2C
LigandBDBM50440092
Substrate/Competitorn/a
Meas. Tech.ChEMBL_983748 (CHEMBL2427901)
IC50 3600±n/a nM
Citation Acker, TMKhatri, AVance, KMSlabber, CBacsa, JSnyder, JPTraynelis, SFLiotta, DC Structure-activity relationships and pharmacophore model of a noncompetitive pyrazoline containing class of GluN2C/GluN2D selective antagonists. J Med Chem56:6434-56 (2013) 
 
Glutamate receptor ionotropic, NMDA 2C
Name:Glutamate receptor ionotropic, NMDA 2C
Type:Protein
Mol. Mass.:135305.94
Organism:Rattus norvegicus (Rat)
Description:Q00961
Residue:1237
BDBM50440092
NameBDBM50440092
Synonyms:CHEMBL2426085
TypeSmall organic molecule
Emp. Form.C28H21BrClN3O4
Mol. Mass.578.841
SMILESOC(=O)CCC(=O)N1N=C(CC1c1ccc(Br)cc1)c1c(-c2ccccc2)c2cc(Cl)ccc2[nH]c1=O