Reaction Details
TargetGlucocorticoid receptor
LigandBDBM50440100
Substrate/Competitorn/a
Meas. Tech.ChEMBL_983770 (CHEMBL2428109)
Ki 0.930000±n/a nM
Citation Gilmore, JLSheppeck, JEWang, JDhar, TGCavallaro, CDoweyko, AMMckay, LCunningham, MDHabte, SFNadler, SGDodd, JHSomerville, JEBarrish, JC Synthesis and structure-activity relationships of novel indazolyl glucocorticoid receptor partial agonists. Bioorg Med Chem Lett23:5448-51 (2013) 
 
Glucocorticoid receptor
Name:Glucocorticoid receptor
Type:Enzyme
Mol. Mass.:85656.87
Organism:Homo sapiens (Human)
Description:P04150
Residue:777
BDBM50440100
NameBDBM50440100
Synonyms:CHEMBL2426120
TypeSmall organic molecule
Emp. Form.C24H24FN3O2S
Mol. Mass.437.53
SMILESCC(CNS(C)(=O)=O)[C@@H](c1ccccc1)c1ccc2n(ncc2c1)-c1ccc(F)cc1