Reaction Details
TargetCyclin-dependent kinase 7
LigandBDBM50440137
Substrate/Competitorn/a
Meas. Tech.ChEMBL_981180 (CHEMBL2427173)
IC50 1645±n/a nM
Citation Sun, JLv, XHQiu, HYWang, YTDu, QRLi, DDYang, YHZhu, HL Synthesis, biological evaluation and molecular docking studies of pyrazole derivatives coupling with a thiourea moiety as novel CDKs inhibitors. Eur J Med Chem68:1-9 (2013) 
 
Cyclin-dependent kinase 7
Name:Cyclin-dependent kinase 7
Type:Enzyme Subunit
Mol. Mass.:39047.01
Organism:Homo sapiens (Human)
Description:n/a
Residue:346
BDBM50440137
NameBDBM50440137
Synonyms:CHEMBL2426387
TypeSmall organic molecule
Emp. Form.C24H19ClN4O2S
Mol. Mass.462.951
SMILESCOc1ccc(NC(=S)NC(=O)c2cn(nc2-c2ccc(Cl)cc2)-c2ccccc2)cc1