Reaction Details
TargetGlucocorticoid receptor
LigandBDBM50440485
Substrate/Competitorn/a
Meas. Tech.ChEMBL_983187 (CHEMBL2428099)
EC50 1200±n/a nM
Citation Xiao, HYWu, DRSheppeck, JEHabte, SFCunningham, MDSomerville, JEBarrish, JCNadler, SGDhar, TG Heterocyclic glucocorticoid receptor modulators with a 2,2-dimethyl-3-phenyl-N-(thiazol or thiadiazol-2-yl)propanamide core. Bioorg Med Chem Lett23:5571-4 (2013) 
 
Glucocorticoid receptor
Name:Glucocorticoid receptor
Type:Enzyme
Mol. Mass.:85656.87
Organism:Homo sapiens (Human)
Description:P04150
Residue:777
BDBM50440485
NameBDBM50440485
Synonyms:CHEMBL2426138
TypeSmall organic molecule
Emp. Form.C26H22FN5OS
Mol. Mass.471.549
SMILESCC(C)(C(c1ccccc1)c1ccc2c(ncn2c1)-c1ccc(F)cc1)C(=O)Nc1nncs1