Reaction Details
TargetGlucocorticoid receptor
LigandBDBM50440487
Substrate/Competitorn/a
Meas. Tech.ChEMBL_983188 (CHEMBL2428100)
Ki 3.00±n/a nM
Citation Xiao, HYWu, DRSheppeck, JEHabte, SFCunningham, MDSomerville, JEBarrish, JCNadler, SGDhar, TG Heterocyclic glucocorticoid receptor modulators with a 2,2-dimethyl-3-phenyl-N-(thiazol or thiadiazol-2-yl)propanamide core. Bioorg Med Chem Lett23:5571-4 (2013) 
 
Glucocorticoid receptor
Name:Glucocorticoid receptor
Type:Enzyme
Mol. Mass.:85656.87
Organism:Homo sapiens (Human)
Description:P04150
Residue:777
BDBM50440487
NameBDBM50440487
Synonyms:CHEMBL2426137
TypeSmall organic molecule
Emp. Form.C27H23FN4OS
Mol. Mass.470.561
SMILESCC(C)(C(c1ccccc1)c1ccc2c(ncn2c1)-c1ccc(F)cc1)C(=O)Nc1nccs1