Reaction Details
TargetC-C motif chemokine 2
LigandBDBM50331728
Substrate/Competitorn/a
Meas. Tech.ChEMBL_983383 (CHEMBL2428937)
Kd 0.230000±n/a nM
Citation Vilums, MZweemer, AJYu, Zde Vries, HHillger, JMWapenaar, HBollen, IABarmare, FGross, RClemens, JKrenitsky, PBrussee, JStamos, DSaunders, JHeitman, LHIjzerman, AP Structure-kinetic relationships--an overlooked parameter in hit-to-lead optimization: a case of cyclopentylamines as chemokine receptor 2 antagonists. J Med Chem56:7706-14 (2013) 
 
C-C motif chemokine 2
Name:C-C motif chemokine 2
Type:PROTEIN
Mol. Mass.:11032.44
Organism:Homo sapiens (Human)
Description:ChEMBL_1363188
Residue:99
BDBM50331728
NameBDBM50331728
Synonyms:CHEMBL1289316 | N-(2-((3S,4S)-1-(cis-4-(benzo[d][1,3]dioxol-5-yl)-4-hydroxycyclohexyl)-4-ethoxypyrrolidin-3-ylamino)-2-oxoethyl)-3-(trifluoromethyl)benzamide
TypeSmall organic molecule
Emp. Form.C29H34F3N3O6
Mol. Mass.577.592
SMILESCCO[C@H]1CN(C[C@@H]1NC(=O)CNC(=O)c1cccc(c1)C(F)(F)F)[C@H]1CC[C@](O)(CC1)c1ccc2OCOc2c1