Reaction Details
TargetC-C motif chemokine 2
LigandBDBM50440556
Substrate/Competitorn/a
Meas. Tech.ChEMBL_983389 (CHEMBL2428943)
Ki 3.9±n/a nM
Citation Vilums, MZweemer, AJYu, Zde Vries, HHillger, JMWapenaar, HBollen, IABarmare, FGross, RClemens, JKrenitsky, PBrussee, JStamos, DSaunders, JHeitman, LHIjzerman, AP Structure-kinetic relationships--an overlooked parameter in hit-to-lead optimization: a case of cyclopentylamines as chemokine receptor 2 antagonists. J Med Chem56:7706-14 (2013) 
 
C-C motif chemokine 2
Name:C-C motif chemokine 2
Type:PROTEIN
Mol. Mass.:11032.44
Organism:Homo sapiens (Human)
Description:ChEMBL_1363188
Residue:99
BDBM50440556
NameBDBM50440556
Synonyms:CHEMBL2426334
TypeSmall organic molecule
Emp. Form.C29H34F6N2O3
Mol. Mass.572.5823
SMILESCOc1cc2CCC(N[C@@H]3CC[C@](C3)(C(C)C)C(=O)NCc3cc(cc(c3)C(F)(F)F)C(F)(F)F)c2cc1OC