Reaction Details
TargetMBT domain-containing protein 1
LigandBDBM50440571
Substrate/Competitorn/a
Meas. Tech.ChEMBL_983404 (CHEMBL2429074)
IC50 4900±n/a nM
Citation James, LIKorboukh, VKKrichevsky, LBaughman, BMHerold, JMNorris, JLJin, JKireev, DBJanzen, WPArrowsmith, CHFrye, SV Small-molecule ligands of methyl-lysine binding proteins: optimization of selectivity for L3MBTL3. J Med Chem56:7358-71 (2013) 
 
MBT domain-containing protein 1
Name:MBT domain-containing protein 1
Type:Protein
Mol. Mass.:70557.67
Organism:Homo sapiens (Human)
Description:n/a
Residue:628
BDBM50440571
NameBDBM50440571
Synonyms:CHEMBL2426474
TypeSmall organic molecule
Emp. Form.C28H42N4O2
Mol. Mass.466.6587
SMILESO=C(N1CCC(CC1)N1CCCCC1)c1ccc(cc1)C(=O)N1CCC(CC1)N1CCCCC1