Reaction Details
TargetMBT domain-containing protein 1
LigandBDBM50440603
Substrate/Competitorn/a
Meas. Tech.ChEMBL_983404 (CHEMBL2429074)
IC50>10000±n/a nM
Citation James, LIKorboukh, VKKrichevsky, LBaughman, BMHerold, JMNorris, JLJin, JKireev, DBJanzen, WPArrowsmith, CHFrye, SV Small-molecule ligands of methyl-lysine binding proteins: optimization of selectivity for L3MBTL3. J Med Chem56:7358-71 (2013) 
 
MBT domain-containing protein 1
Name:MBT domain-containing protein 1
Type:Protein
Mol. Mass.:70557.67
Organism:Homo sapiens (Human)
Description:n/a
Residue:628
BDBM50440603
NameBDBM50440603
Synonyms:CHEMBL2426498
TypeSmall organic molecule
Emp. Form.C26H38N4O2
Mol. Mass.438.6055
SMILESO=C(N1CCC(CC1)N1CCCC1)c1ccc(cc1)C(=O)N1CCC(CC1)N1CCCC1