Reaction Details
TargetScm-like with four MBT domains protein 1
LigandBDBM50440579
Substrate/Competitorn/a
Meas. Tech.ChEMBL_983406 (CHEMBL2429076)
IC50>10000±n/a nM
Citation James, LIKorboukh, VKKrichevsky, LBaughman, BMHerold, JMNorris, JLJin, JKireev, DBJanzen, WPArrowsmith, CHFrye, SV Small-molecule ligands of methyl-lysine binding proteins: optimization of selectivity for L3MBTL3. J Med Chem56:7358-71 (2013) 
 
Scm-like with four MBT domains protein 1
Name:Scm-like with four MBT domains protein 1
Type:PROTEIN
Mol. Mass.:98135.34
Organism:Homo sapiens (Human)
Description:ChEMBL_104121
Residue:866
BDBM50440579
NameBDBM50440579
Synonyms:CHEMBL2426466
TypeSmall organic molecule
Emp. Form.C25H36N4O2
Mol. Mass.424.5789
SMILESO=C(N1CCC(CC1)N1CCCC1)c1ccc(cc1)C(=O)N1CCC2(CCNC2)CC1