Reaction Details
TargetLethal(3)malignant brain tumor-like protein 3
LigandBDBM50440605
Substrate/Competitorn/a
Meas. Tech.ChEMBL_983410 (CHEMBL2429080)
IC50 140±n/a nM
Citation James, LIKorboukh, VKKrichevsky, LBaughman, BMHerold, JMNorris, JLJin, JKireev, DBJanzen, WPArrowsmith, CHFrye, SV Small-molecule ligands of methyl-lysine binding proteins: optimization of selectivity for L3MBTL3. J Med Chem56:7358-71 (2013) 
 
Lethal(3)malignant brain tumor-like protein 3
Name:Lethal(3)malignant brain tumor-like protein 3
Type:Protein
Mol. Mass.:88334.17
Organism:Homo sapiens (Human)
Description:n/a
Residue:780
BDBM50440605
NameBDBM50440605
Synonyms:CHEMBL2424677
TypeSmall organic molecule
Emp. Form.C33H39N5O2
Mol. Mass.537.6951
SMILESCCN1Cc2ccc(NC(=O)c3ccc(C(=O)N4CCC(CC4)C4CCCN4)c(Nc4ccccc4)c3)cc2C1