Reaction Details
TargetLethal(3)malignant brain tumor-like protein 3
LigandBDBM50440614
Substrate/Competitorn/a
Meas. Tech.ChEMBL_983410 (CHEMBL2429080)
IC50 49±n/a nM
Citation James, LIKorboukh, VKKrichevsky, LBaughman, BMHerold, JMNorris, JLJin, JKireev, DBJanzen, WPArrowsmith, CHFrye, SV Small-molecule ligands of methyl-lysine binding proteins: optimization of selectivity for L3MBTL3. J Med Chem56:7358-71 (2013) 
 
Lethal(3)malignant brain tumor-like protein 3
Name:Lethal(3)malignant brain tumor-like protein 3
Type:Protein
Mol. Mass.:88334.17
Organism:Homo sapiens (Human)
Description:n/a
Residue:780
BDBM50440614
NameBDBM50440614
Synonyms:CHEMBL2426364
TypeSmall organic molecule
Emp. Form.C32H43N5O2
Mol. Mass.529.7161
SMILESO=C(N1CCC(CC1)N1CCCC1)c1ccc(C(=O)N2CCC(CC2)N2CCCC2)c(Nc2ccccc2)c1