Reaction Details
TargetIsoform 4 of Lethal(3)malignant brain tumor-like protein 1 (4)
LigandBDBM50440590
Substrate/Competitorn/a
Meas. Tech.ChEMBL_983408 (CHEMBL2429078)
IC50 3500±n/a nM
Citation James, LIKorboukh, VKKrichevsky, LBaughman, BMHerold, JMNorris, JLJin, JKireev, DBJanzen, WPArrowsmith, CHFrye, SV Small-molecule ligands of methyl-lysine binding proteins: optimization of selectivity for L3MBTL3. J Med Chem56:7358-71 (2013) 
 
Isoform 4 of Lethal(3)malignant brain tumor-like protein 1 (4)
Name:Isoform 4 of Lethal(3)malignant brain tumor-like protein 1 (4)
Type:Protein
Mol. Mass.:83871.06
Organism:Homo sapiens (Human)
Description:Q9Y468-4
Residue:752
BDBM50440590
NameBDBM50440590
Synonyms:CHEMBL2426491
TypeSmall organic molecule
Emp. Form.C27H40N4O2
Mol. Mass.452.6321
SMILESO=C(N1CCC(CC1)C1CCNCC1)c1ccc(cc1)C(=O)N1CCC(CC1)N1CCCC1