Reaction Details
TargetIsoform 4 of Lethal(3)malignant brain tumor-like protein 1 (4)
LigandBDBM50341828
Substrate/Competitorn/a
Meas. Tech.ChEMBL_983408 (CHEMBL2429078)
IC50 4200±n/a nM
Citation James, LIKorboukh, VKKrichevsky, LBaughman, BMHerold, JMNorris, JLJin, JKireev, DBJanzen, WPArrowsmith, CHFrye, SV Small-molecule ligands of methyl-lysine binding proteins: optimization of selectivity for L3MBTL3. J Med Chem56:7358-71 (2013) 
 
Isoform 4 of Lethal(3)malignant brain tumor-like protein 1 (4)
Name:Isoform 4 of Lethal(3)malignant brain tumor-like protein 1 (4)
Type:Protein
Mol. Mass.:83871.06
Organism:Homo sapiens (Human)
Description:Q9Y468-4
Residue:752
BDBM50341828
NameBDBM50341828
Synonyms:3-bromo-5-[(4-pyrrolidin-1-ylpiperidin-1-yl)carbonyl]pyridine CHEMBL1235119
TypeSmall organic molecule
Emp. Form.C15H20BrN3O
Mol. Mass.338.243
SMILESBrc1cncc(c1)C(=O)N1CCC(CC1)N1CCCC1