Reaction Details
TargetLethal(3)malignant brain tumor-like protein 3
LigandBDBM50440613
Substrate/Competitorn/a
Meas. Tech.ChEMBL_983409 (CHEMBL2429079)
IC50 39±n/a nM
Citation James, LIKorboukh, VKKrichevsky, LBaughman, BMHerold, JMNorris, JLJin, JKireev, DBJanzen, WPArrowsmith, CHFrye, SV Small-molecule ligands of methyl-lysine binding proteins: optimization of selectivity for L3MBTL3. J Med Chem56:7358-71 (2013) 
 
Lethal(3)malignant brain tumor-like protein 3
Name:Lethal(3)malignant brain tumor-like protein 3
Type:Protein
Mol. Mass.:88334.17
Organism:Homo sapiens (Human)
Description:n/a
Residue:780
BDBM50440613
NameBDBM50440613
Synonyms:CHEMBL2426365
TypeSmall organic molecule
Emp. Form.C33H45N5O2
Mol. Mass.543.7427
SMILESO=C(N1CCC(CC1)N1CCCC1)c1ccc(C(=O)N2CCC(CC2)N2CCCC2)c(NCc2ccccc2)c1