Reaction Details
TargetLethal(3)malignant brain tumor-like protein 4
LigandBDBM50440562
Substrate/Competitorn/a
Meas. Tech.ChEMBL_983407 (CHEMBL2429077)
IC50>10000±n/a nM
Citation James, LIKorboukh, VKKrichevsky, LBaughman, BMHerold, JMNorris, JLJin, JKireev, DBJanzen, WPArrowsmith, CHFrye, SV Small-molecule ligands of methyl-lysine binding proteins: optimization of selectivity for L3MBTL3. J Med Chem56:7358-71 (2013) 
 
Lethal(3)malignant brain tumor-like protein 4
Name:Lethal(3)malignant brain tumor-like protein 4
Type:PROTEIN
Mol. Mass.:71132.81
Organism:Homo sapiens (Human)
Description:ChEMBL_983407
Residue:623
BDBM50440562
NameBDBM50440562
Synonyms:CHEMBL2426361
TypeSmall organic molecule
Emp. Form.C30H40N4O2
Mol. Mass.488.6642
SMILESO=C(N1CCC(CC1)N1CCCC1)c1ccc2cc(ccc2c1)C(=O)N1CCC(CC1)N1CCCC1