Reaction Details
TargetLethal(3)malignant brain tumor-like protein 4
LigandBDBM50440567
Substrate/Competitorn/a
Meas. Tech.ChEMBL_983407 (CHEMBL2429077)
IC50>10000±n/a nM
Citation James, LIKorboukh, VKKrichevsky, LBaughman, BMHerold, JMNorris, JLJin, JKireev, DBJanzen, WPArrowsmith, CHFrye, SV Small-molecule ligands of methyl-lysine binding proteins: optimization of selectivity for L3MBTL3. J Med Chem56:7358-71 (2013) 
 
Lethal(3)malignant brain tumor-like protein 4
Name:Lethal(3)malignant brain tumor-like protein 4
Type:PROTEIN
Mol. Mass.:71132.81
Organism:Homo sapiens (Human)
Description:ChEMBL_983407
Residue:623
BDBM50440567
NameBDBM50440567
Synonyms:CHEMBL2426477
TypeSmall organic molecule
Emp. Form.C26H37N5O4
Mol. Mass.483.6031
SMILES[O-][N+](=O)c1cc(ccc1C(=O)N1CCC(CC1)N1CCCC1)C(=O)N1CCC(CC1)N1CCCC1