Reaction Details
TargetIsoform 4 of Lethal(3)malignant brain tumor-like protein 1 (4)
LigandBDBM50440560
Substrate/Competitorn/a
Meas. Tech.ChEMBL_983408 (CHEMBL2429078)
IC50 3700±n/a nM
Citation James, LIKorboukh, VKKrichevsky, LBaughman, BMHerold, JMNorris, JLJin, JKireev, DBJanzen, WPArrowsmith, CHFrye, SV Small-molecule ligands of methyl-lysine binding proteins: optimization of selectivity for L3MBTL3. J Med Chem56:7358-71 (2013) 
 
Isoform 4 of Lethal(3)malignant brain tumor-like protein 1 (4)
Name:Isoform 4 of Lethal(3)malignant brain tumor-like protein 1 (4)
Type:Protein
Mol. Mass.:83871.06
Organism:Homo sapiens (Human)
Description:Q9Y468-4
Residue:752
BDBM50440560
NameBDBM50440560
Synonyms:CHEMBL2426363
TypeSmall organic molecule
Emp. Form.C24H36N4O2S
Mol. Mass.444.633
SMILESO=C(N1CCC(CC1)N1CCCC1)c1ccc(s1)C(=O)N1CCC(CC1)N1CCCC1