Reaction Details
TargetLysine-specific demethylase 5A
LigandBDBM50341828
Substrate/Competitorn/a
Meas. Tech.ChEMBL_983400 (CHEMBL2429070)
IC50>10000±n/a nM
Citation James, LIKorboukh, VKKrichevsky, LBaughman, BMHerold, JMNorris, JLJin, JKireev, DBJanzen, WPArrowsmith, CHFrye, SV Small-molecule ligands of methyl-lysine binding proteins: optimization of selectivity for L3MBTL3. J Med Chem56:7358-71 (2013) 
 
Lysine-specific demethylase 5A
Name:Lysine-specific demethylase 5A
Type:Protein
Mol. Mass.:192091.79
Organism:Homo sapiens (Human)
Description:P29375
Residue:1690
BDBM50341828
NameBDBM50341828
Synonyms:3-bromo-5-[(4-pyrrolidin-1-ylpiperidin-1-yl)carbonyl]pyridine CHEMBL1235119
TypeSmall organic molecule
Emp. Form.C15H20BrN3O
Mol. Mass.338.243
SMILESBrc1cncc(c1)C(=O)N1CCC(CC1)N1CCCC1