Reaction Details
TargetE3 ubiquitin-protein ligase UHRF1
LigandBDBM50440608
Substrate/Competitorn/a
Meas. Tech.ChEMBL_983403 (CHEMBL2429073)
IC50>10000±n/a nM
Citation James, LIKorboukh, VKKrichevsky, LBaughman, BMHerold, JMNorris, JLJin, JKireev, DBJanzen, WPArrowsmith, CHFrye, SV Small-molecule ligands of methyl-lysine binding proteins: optimization of selectivity for L3MBTL3. J Med Chem56:7358-71 (2013) 
 
E3 ubiquitin-protein ligase UHRF1
Name:E3 ubiquitin-protein ligase UHRF1
Type:Protein
Mol. Mass.:89822.48
Organism:Homo sapiens (Human)
Description:n/a
Residue:793
BDBM50440608
NameBDBM50440608
Synonyms:CHEMBL2426374
TypeSmall organic molecule
Emp. Form.C29H36N4O2
Mol. Mass.472.6217
SMILESCCN1Cc2ccc(NC(=O)c3ccc(cc3)C(=O)N3CC4CCC(C3)C4N3CCCC3)cc2C1