Reaction Details
TargetE3 ubiquitin-protein ligase UHRF1
LigandBDBM50440586
Substrate/Competitorn/a
Meas. Tech.ChEMBL_983403 (CHEMBL2429073)
IC50>10000±n/a nM
Citation James, LIKorboukh, VKKrichevsky, LBaughman, BMHerold, JMNorris, JLJin, JKireev, DBJanzen, WPArrowsmith, CHFrye, SV Small-molecule ligands of methyl-lysine binding proteins: optimization of selectivity for L3MBTL3. J Med Chem56:7358-71 (2013) 
 
E3 ubiquitin-protein ligase UHRF1
Name:E3 ubiquitin-protein ligase UHRF1
Type:Protein
Mol. Mass.:89822.48
Organism:Homo sapiens (Human)
Description:n/a
Residue:793
BDBM50440586
NameBDBM50440586
Synonyms:CHEMBL2426495
TypeSmall organic molecule
Emp. Form.C28H40N4O2
Mol. Mass.464.6428
SMILESO=C(N1CCC(CC1)N1CCCC1)c1ccc(cc1)C(=O)N1CC2CCC(C1)C2N1CCCC1