Reaction Details
TargetTP53-binding protein 1
LigandBDBM50440565
Substrate/Competitorn/a
Meas. Tech.ChEMBL_983402 (CHEMBL2429072)
IC50>10000±n/a nM
Citation James, LIKorboukh, VKKrichevsky, LBaughman, BMHerold, JMNorris, JLJin, JKireev, DBJanzen, WPArrowsmith, CHFrye, SV Small-molecule ligands of methyl-lysine binding proteins: optimization of selectivity for L3MBTL3. J Med Chem56:7358-71 (2013) 
 
TP53-binding protein 1
Name:TP53-binding protein 1
Type:PROTEIN
Mol. Mass.:213442.98
Organism:Homo sapiens (Human)
Description:ChEMBL_107658
Residue:1972
BDBM50440565
NameBDBM50440565
Synonyms:CHEMBL2426358
TypeSmall organic molecule
Emp. Form.C26H34F4N4O2
Mol. Mass.510.5674
SMILESFc1c(F)c(C(=O)N2CCC(CC2)N2CCCC2)c(F)c(F)c1C(=O)N1CCC(CC1)N1CCCC1