Reaction Details
TargetTP53-binding protein 1
LigandBDBM50440570
Substrate/Competitorn/a
Meas. Tech.ChEMBL_983402 (CHEMBL2429072)
IC50>10000±n/a nM
Citation James, LIKorboukh, VKKrichevsky, LBaughman, BMHerold, JMNorris, JLJin, JKireev, DBJanzen, WPArrowsmith, CHFrye, SV Small-molecule ligands of methyl-lysine binding proteins: optimization of selectivity for L3MBTL3. J Med Chem56:7358-71 (2013) 
 
TP53-binding protein 1
Name:TP53-binding protein 1
Type:PROTEIN
Mol. Mass.:213442.98
Organism:Homo sapiens (Human)
Description:ChEMBL_107658
Residue:1972
BDBM50440570
NameBDBM50440570
Synonyms:CHEMBL2426475
TypeSmall organic molecule
Emp. Form.C22H34N4O2
Mol. Mass.386.531
SMILESCN(C)C1CCN(CC1)C(=O)c1ccc(cc1)C(=O)N1CCC(CC1)N(C)C