Reaction Details
TargetTP53-binding protein 1
LigandBDBM50440577
Substrate/Competitorn/a
Meas. Tech.ChEMBL_983402 (CHEMBL2429072)
IC50>10000±n/a nM
Citation James, LIKorboukh, VKKrichevsky, LBaughman, BMHerold, JMNorris, JLJin, JKireev, DBJanzen, WPArrowsmith, CHFrye, SV Small-molecule ligands of methyl-lysine binding proteins: optimization of selectivity for L3MBTL3. J Med Chem56:7358-71 (2013) 
 
TP53-binding protein 1
Name:TP53-binding protein 1
Type:PROTEIN
Mol. Mass.:213442.98
Organism:Homo sapiens (Human)
Description:ChEMBL_107658
Residue:1972
BDBM50440577
NameBDBM50440577
Synonyms:CHEMBL2426468
TypeSmall organic molecule
Emp. Form.C25H37N5O2
Mol. Mass.439.5936
SMILESCN1CCN2CC(CC2C1)NC(=O)c1ccc(cc1)C(=O)N1CCC(CC1)N1CCCC1