Reaction Details
TargetChromobox protein homolog 7
LigandBDBM50440608
Substrate/Competitorn/a
Meas. Tech.ChEMBL_983405 (CHEMBL2429075)
IC50>10000±n/a nM
Citation James, LIKorboukh, VKKrichevsky, LBaughman, BMHerold, JMNorris, JLJin, JKireev, DBJanzen, WPArrowsmith, CHFrye, SV Small-molecule ligands of methyl-lysine binding proteins: optimization of selectivity for L3MBTL3. J Med Chem56:7358-71 (2013) 
 
Chromobox protein homolog 7
Name:Chromobox protein homolog 7
Type:Protein
Mol. Mass.:28351.76
Organism:Homo sapiens (Human)
Description:n/a
Residue:251
BDBM50440608
NameBDBM50440608
Synonyms:CHEMBL2426374
TypeSmall organic molecule
Emp. Form.C29H36N4O2
Mol. Mass.472.6217
SMILESCCN1Cc2ccc(NC(=O)c3ccc(cc3)C(=O)N3CC4CCC(C3)C4N3CCCC3)cc2C1