Reaction Details
Target3-hydroxyacyl-[acyl-carrier-protein] dehydratase
LigandBDBM50070942
Substrate/Competitorn/a
Meas. Tech.ChEMBL_983601 (CHEMBL2427113)
IC50 30±n/a nM
Citation Belluti, FPerozzo, RLauciello, LColizzi, FKostrewa, DBisi, AGobbi, SRampa, ABolognesi, MLRecanatini, MBrun, RScapozza, LCavalli, A Design, synthesis, and biological and crystallographic evaluation of novel inhibitors of Plasmodium falciparum enoyl-ACP-reductase (PfFabI). J Med Chem56:7516-26 (2013) 
 
3-hydroxyacyl-[acyl-carrier-protein] dehydratase
Name:3-hydroxyacyl-[acyl-carrier-protein] dehydratase
Synonyms:Fatty acid synthase
Type:PROTEIN
Mol. Mass.:26222.50
Organism:Plasmodium falciparum
Description:ChEMBL_983601
Residue:230
BDBM50070942
NameBDBM50070942
TypeSmall organic molecule
Emp. Form.C22H18O11
Mol. Mass.458.3717
SMILESOc1cc(O)c2C[C@@H](OC(=O)c3cc(O)c(O)c(O)c3)[C@H](Oc2c1)c1cc(O)c(O)c(O)c1