Reaction Details
Target3-oxoacyl-[acyl-carrier-protein] reductase
LigandBDBM50440620
Substrate/Competitorn/a
Meas. Tech.ChEMBL_983602 (CHEMBL2427114)
IC50 99000±n/a nM
Citation Belluti, FPerozzo, RLauciello, LColizzi, FKostrewa, DBisi, AGobbi, SRampa, ABolognesi, MLRecanatini, MBrun, RScapozza, LCavalli, A Design, synthesis, and biological and crystallographic evaluation of novel inhibitors of Plasmodium falciparum enoyl-ACP-reductase (PfFabI). J Med Chem56:7516-26 (2013) 
 
3-oxoacyl-[acyl-carrier-protein] reductase
Name:3-oxoacyl-[acyl-carrier-protein] reductase
Type:PROTEIN
Mol. Mass.:33360.55
Organism:Plasmodium falciparum (isolate 3D7)
Description:ChEMBL_107660
Residue:301
BDBM50440620
NameBDBM50440620
Synonyms:CHEMBL2426552
TypeSmall organic molecule
Emp. Form.C15H9ClO5
Mol. Mass.304.682
SMILESOc1ccc2cc(Oc3ccc(Cl)cc3O)c(=O)oc2c1