Reaction Details
TargetCalcitonin gene-related peptide type 1 receptor
LigandBDBM50356282
Substrate/Competitorn/a
Meas. Tech.ChEMBL_986467 (CHEMBL2434392)
Ki 0.021000±n/a nM
Citation Bell, IMGallicchio, SNStump, CABruno, JGFan, HGantert, LTHostetler, EDKemmerer, ALMcWherter, MMoore, ELMosser, SDPurcell, MLRiffel, KSalvatore, CASanabria-Bohórquez, SStaas, DDWhite, RBWilliams, MZartman, CBCook, JJHargreaves, RJKane, SAGraham, SLSelnick, HG [(11)C]MK-4232: The First Positron Emission Tomography Tracer for the Calcitonin Gene-Related Peptide Receptor. ACS Med Chem Lett4:863-8 (2013) 
 
Calcitonin gene-related peptide type 1 receptor
Name:Calcitonin gene-related peptide type 1 receptor
Type:Enzyme Catalytic Domain
Mol. Mass.:52980.45
Organism:Homo sapiens (Human)
Description:Q16602
Residue:461
BDBM50356282
NameBDBM50356282
Synonyms:CHEMBL1910936
TypeSmall organic molecule
Emp. Form.C31H29F2N5O3
Mol. Mass.557.5905
SMILESFc1cc(F)cc(c1)[C@@H]1CNC2(CCCC2)C(=O)N1CC(=O)Nc1ccc2C[C@]3(Cc2c1)C(=O)Nc1ncccc31