Reaction Details
TargetPlatelet-derived growth factor receptor beta
LigandBDBM50441059
Substrate/Competitorn/a
Meas. Tech.ChEMBL_985868 (CHEMBL2434541)
IC50 41±n/a nM
Citation Ding, LTang, FHuang, WJin, QShen, HWei, P Design, synthesis, and biological evaluation of novel 3-pyrrolo[b]cyclohexylene-2-dihydroindolinone derivatives as potent receptor tyrosine kinase inhibitors. Bioorg Med Chem Lett23:5630-3 (2013) 
 
Platelet-derived growth factor receptor beta
Name:Platelet-derived growth factor receptor beta
Type:Enzyme
Mol. Mass.:123922.25
Organism:Homo sapiens (Human)
Description:P09619
Residue:1106
BDBM50441059
NameBDBM50441059
Synonyms:CHEMBL2430252
TypeSmall organic molecule
Emp. Form.C28H33FN4O2
Mol. Mass.476.5856
SMILESCc1[nH]c2c(CCC\C2=C2\C(=O)Nc3ccc(F)cc23)c1C(=O)N1CCC(CC1)N1CCCCC1