Reaction Details
TargetPlatelet-derived growth factor receptor beta
LigandBDBM50441063
Substrate/Competitorn/a
Meas. Tech.ChEMBL_985868 (CHEMBL2434541)
IC50 18±n/a nM
Citation Ding, LTang, FHuang, WJin, QShen, HWei, P Design, synthesis, and biological evaluation of novel 3-pyrrolo[b]cyclohexylene-2-dihydroindolinone derivatives as potent receptor tyrosine kinase inhibitors. Bioorg Med Chem Lett23:5630-3 (2013) 
 
Platelet-derived growth factor receptor beta
Name:Platelet-derived growth factor receptor beta
Type:Enzyme
Mol. Mass.:123922.25
Organism:Homo sapiens (Human)
Description:P09619
Residue:1106
BDBM50441063
NameBDBM50441063
Synonyms:CHEMBL2430248
TypeSmall organic molecule
Emp. Form.C25H29FN4O3
Mol. Mass.452.5212
SMILESCc1[nH]c2c(CCC\C2=C2\C(=O)Nc3ccc(F)cc23)c1C(=O)NCCCN1CCOCC1