Reaction Details
TargetPlatelet-derived growth factor receptor beta
LigandBDBM50441078
Substrate/Competitorn/a
Meas. Tech.ChEMBL_985868 (CHEMBL2434541)
IC50 7.6±n/a nM
Citation Ding, LTang, FHuang, WJin, QShen, HWei, P Design, synthesis, and biological evaluation of novel 3-pyrrolo[b]cyclohexylene-2-dihydroindolinone derivatives as potent receptor tyrosine kinase inhibitors. Bioorg Med Chem Lett23:5630-3 (2013) 
 
Platelet-derived growth factor receptor beta
Name:Platelet-derived growth factor receptor beta
Type:Enzyme
Mol. Mass.:123922.25
Organism:Homo sapiens (Human)
Description:P09619
Residue:1106
BDBM50441078
NameBDBM50441078
Synonyms:CHEMBL2430265
TypeSmall organic molecule
Emp. Form.C24H29BrN4O2
Mol. Mass.485.417
SMILESCCN(CC)CCNC(=O)c1c(C)[nH]c2c1CCC\C2=C1\C(=O)Nc2ccc(Br)cc12