Reaction Details
TargetCasein kinase I isoform delta
LigandBDBM50441089
Substrate/Competitorn/a
Meas. Tech.ChEMBL_986151 (CHEMBL2432951)
IC50 838±n/a nM
Citation Huart, ASSaxty, BMerritt, ANekulova, MLewis, SHuang, YVojtesek, BKettleborough, CHupp, TR A Casein kinase 1/Checkpoint kinase 1 pyrazolo-pyridine protein kinase inhibitor as novel activator of the p53 pathway. Bioorg Med Chem Lett23:5578-85 (2013) 
 
Casein kinase I isoform delta
Name:Casein kinase I isoform delta
Type:Enzyme
Mol. Mass.:47342.73
Organism:Rattus norvegicus (rat)
Description:Q06486
Residue:415
BDBM50441089
NameBDBM50441089
Synonyms:CHEMBL2430324
TypeSmall organic molecule
Emp. Form.C16H14N4O2
Mol. Mass.294.308
SMILESCC(=O)Nc1nccc(n1)-c1c(C)onc1-c1ccccc1