Reaction Details
TargetSerine/threonine-protein kinase Nek2
LigandBDBM50441090
Substrate/Competitorn/a
Meas. Tech.ChEMBL_986541 (CHEMBL2434782)
IC50 2000±n/a nM
Citation Huart, ASSaxty, BMerritt, ANekulova, MLewis, SHuang, YVojtesek, BKettleborough, CHupp, TR A Casein kinase 1/Checkpoint kinase 1 pyrazolo-pyridine protein kinase inhibitor as novel activator of the p53 pathway. Bioorg Med Chem Lett23:5578-85 (2013) 
 
Serine/threonine-protein kinase Nek2
Name:Serine/threonine-protein kinase Nek2
Type:Enzyme
Mol. Mass.:51776.96
Organism:Homo sapiens (Human)
Description:P51955
Residue:445
BDBM50441090
NameBDBM50441090
Synonyms:CHEMBL2430323 | US9669028, 114 N-(3-(3-methyl-1H-pyrazolo[3,4-b]pyridin-5-yl)phenyl)acetamide
TypeSmall organic molecule
Emp. Form.C15H14N4O
Mol. Mass.266.2979
SMILESCC(=O)Nc1cccc(c1)-c1cnc2[nH]nc(C)c2c1