Reaction Details
TargetDelta-aminolevulinic acid dehydratase
LigandBDBM50441099
Substrate/Competitorn/a
Meas. Tech.ChEMBL_983894 (CHEMBL2433504)
IC50 740000±n/a nM
Citation Lentz, CSStumpfe, DBajorath, JFamulok, MHoerauf, APfarr, KM New chemotypes for wALADin1-like inhibitors of delta-aminolevulinic acid dehydratase from Wolbachia endobacteria. Bioorg Med Chem Lett23:5558-62 (2013) 
 
Delta-aminolevulinic acid dehydratase
Name:Delta-aminolevulinic acid dehydratase
Type:PROTEIN
Mol. Mass.:36296.00
Organism:Homo sapiens (Human)
Description:ChEMBL_1365623
Residue:330
BDBM50441099
NameBDBM50441099
Synonyms:CHEMBL2430574
TypeSmall organic molecule
Emp. Form.C23H18F3N3O3S
Mol. Mass.473.468
SMILESOC(=O)c1ccc2n(Cc3cccc(c3)C(F)(F)F)c(CCNC(=O)c3cccs3)nc2c1