Reaction Details
TargetDisintegrin and metalloproteinase domain-containing protein 10
LigandBDBM50441212
Substrate/Competitorn/a
Meas. Tech.ChEMBL_984236 (CHEMBL2432396)
IC50 150±n/a nM
Citation Nuti, ECasalini, FSantamaria, SFabbi, MCarbotti, GFerrini, SMarinelli, LLa Pietra, VNovellino, ECamodeca, COrlandini, ENencetti, SRossello, A Selective arylsulfonamide inhibitors of ADAM-17: hit optimization and activity in ovarian cancer cell models. J Med Chem56:8089-103 (2013) 
 
Disintegrin and metalloproteinase domain-containing protein 10
Name:Disintegrin and metalloproteinase domain-containing protein 10
Type:Enzyme
Mol. Mass.:84160.93
Organism:Homo sapiens (Human)
Description:O14672
Residue:748
BDBM50441212
NameBDBM50441212
Synonyms:CHEMBL2431028
TypeSmall organic molecule
Emp. Form.C19H22Br2N4O6S
Mol. Mass.594.274
SMILESNC(=O)NCCC[C@@H](NS(=O)(=O)c1ccc(OCc2cc(Br)cc(Br)c2)cc1)C(=O)NO