Reaction Details
TargetDisintegrin and metalloproteinase domain-containing protein 17
LigandBDBM50441213
Substrate/Competitorn/a
Meas. Tech.ChEMBL_984240 (CHEMBL2432518)
IC50 11±n/a nM
Citation Nuti, ECasalini, FSantamaria, SFabbi, MCarbotti, GFerrini, SMarinelli, LLa Pietra, VNovellino, ECamodeca, COrlandini, ENencetti, SRossello, A Selective arylsulfonamide inhibitors of ADAM-17: hit optimization and activity in ovarian cancer cell models. J Med Chem56:8089-103 (2013) 
 
Disintegrin and metalloproteinase domain-containing protein 17
Name:Disintegrin and metalloproteinase domain-containing protein 17
Type:Enzyme
Mol. Mass.:93007.89
Organism:Homo sapiens (Human)
Description:
Residue:824
BDBM50441213
NameBDBM50441213
Synonyms:CHEMBL2431027
TypeSmall organic molecule
Emp. Form.C26H27Br2N3O7S
Mol. Mass.685.381
SMILESONC(=O)[C@@H](CCCNC(=O)OCc1ccccc1)NS(=O)(=O)c1ccc(OCc2cc(Br)cc(Br)c2)cc1