Reaction Details
TargetCytochrome P450 1A2
LigandBDBM50441232
Substrate/Competitorn/a
Meas. Tech.ChEMBL_984534 (CHEMBL2433740)
IC50 5300±n/a nM
Citation Turlington, MNoetzel, MJChun, AZhou, YGogliotti, RDNguyen, EDGregory, KJVinson, PNRook, JMGogi, KKXiang, ZBridges, TMDaniels, JSJones, CNiswender, CMMeiler, JConn, PJLindsley, CWStauffer, SR Exploration of allosteric agonism structure-activity relationships within an acetylene series of metabotropic glutamate receptor 5 (mGlu5) positive allosteric modulators (PAMs): discovery of 5-((3-fluorophenyl)ethynyl)-N-(3-methyloxetan-3-yl)picolinamide (ML254). J Med Chem56:7976-96 (2013) 
 
Cytochrome P450 1A2
Name:Cytochrome P450 1A2
Type:Enzyme
Mol. Mass.:58423.38
Organism:Homo sapiens (Human)
Description:P05177
Residue:516
BDBM50441232
NameBDBM50441232
Synonyms:CHEMBL2431173
TypeSmall organic molecule
Emp. Form.C18H15FN2O2
Mol. Mass.310.3223
SMILESCC1(COC1)NC(=O)c1ccc(cn1)C#Cc1cccc(F)c1