Reaction Details
TargetCytochrome P450 2C9
LigandBDBM50441246
Substrate/Competitorn/a
Meas. Tech.ChEMBL_984596 (CHEMBL2434090)
IC50>5000±n/a nM
Citation Schoenfeld, RCBourdet, DLBrameld, KAChin, Ede Vicente, JFung, AHarris, SFLee, EKLe Pogam, SLeveque, VLi, JLui, ASNajera, IRajyaguru, SSangi, MSteiner, STalamas, FXTaygerly, JPZhao, J Discovery of a novel series of potent non-nucleoside inhibitors of hepatitis C virus NS5B. J Med Chem56:8163-82 (2013) 
 
Cytochrome P450 2C9
Name:Cytochrome P450 2C9
Type:Enzyme
Mol. Mass.:55636.33
Organism:Homo sapiens (Human)
Description:P11712
Residue:490
BDBM50441246
NameBDBM50441246
Synonyms:CHEMBL2431456
TypeSmall organic molecule
Emp. Form.C25H30N2O4S
Mol. Mass.454.582
SMILESCOc1c(CCc2ccc(NS(C)(=O)=O)cc2)cc(cc1C(C)(C)C)-c1ccc[nH]c1=O