Reaction Details
TargetPapain
LigandBDBM50441676
Substrate/Competitorn/a
Meas. Tech.ChEMBL_988143 (CHEMBL2439234)
IC50>10000±n/a nM
Citation Ribeiro, CJKumar, SPGut, JGonçalves, LMRosenthal, PJMoreira, RSantos, MM Squaric acid/4-aminoquinoline conjugates: novel potent antiplasmodial agents. Eur J Med Chem69:365-72 (2013) 
 
Papain
Name:Papain
Type:Enzyme
Mol. Mass.:38923.01
Organism:Carica papaya
Description:Papain was purchased from Sigma, Germany.
Residue:345
BDBM50441676
NameBDBM50441676
Synonyms:CHEMBL2435704
TypeSmall organic molecule
Emp. Form.C44H40Cl2N8O4
Mol. Mass.815.746
SMILESClc1ccc2c(NCCNC(=O)[C@H](Cc3ccccc3)Nc3c(N[C@@H](Cc4ccccc4)C(=O)NCCNc4ccnc5cc(Cl)ccc45)c(=O)c3=O)ccnc2c1