Reaction Details
TargetPapain
LigandBDBM50441680
Substrate/Competitorn/a
Meas. Tech.ChEMBL_988143 (CHEMBL2439234)
IC50>10000±n/a nM
Citation Ribeiro, CJKumar, SPGut, JGonçalves, LMRosenthal, PJMoreira, RSantos, MM Squaric acid/4-aminoquinoline conjugates: novel potent antiplasmodial agents. Eur J Med Chem69:365-72 (2013) 
 
Papain
Name:Papain
Type:Enzyme
Mol. Mass.:38923.01
Organism:Carica papaya
Description:Papain was purchased from Sigma, Germany.
Residue:345
BDBM50441680
NameBDBM50441680
Synonyms:CHEMBL2435698
TypeSmall organic molecule
Emp. Form.C21H22ClN3O3
Mol. Mass.399.871
SMILESCCCCOc1c(N2CCN(CC2)c2ccnc3cc(Cl)ccc23)c(=O)c1=O