Reaction Details
TargetC-C chemokine receptor type 5
LigandBDBM50441726
Substrate/Competitorn/a
Meas. Tech.ChEMBL_988289 (CHEMBL2439743)
IC50 0.900000±n/a nM
Citation Skerlj, RBridger, GZhou, YBourque, EMcEachern, EMetz, MHarwig, CLi, TSYang, WBogucki, DZhu, YLangille, JVeale, DBa, TBey, MBaird, IKaller, AKrumpak, MLeitch, DSatori, MVocadlo, KGuay, DNan, SYee, HCrawford, JChen, GWilson, TCarpenter, BGauthier, DMacfarland, RMosi, RBodart, VWong, RFricker, SSchols, D Design of substituted imidazolidinylpiperidinylbenzoic acids as chemokine receptor 5 antagonists: potent inhibitors of R5 HIV-1 replication. J Med Chem56:8049-65 (2013) 
 
C-C chemokine receptor type 5
Name:C-C chemokine receptor type 5
Type:Enzyme
Mol. Mass.:40540.21
Organism:Homo sapiens (Human)
Description:P51681
Residue:352
BDBM50441726
NameBDBM50441726
Synonyms:CHEMBL2435907
TypeSmall organic molecule
Emp. Form.C31H42ClN5O2
Mol. Mass.552.15
SMILESCC(CCNC(=O)c1c(C)cc(Cl)nc1C)N1CCC(CC1)N1[C@@H](CN(C2CCCC2)C1=O)c1ccccc1