Reaction Details
TargetC-C chemokine receptor type 5
LigandBDBM50441694
Substrate/Competitorn/a
Meas. Tech.ChEMBL_988290 (CHEMBL2439744)
IC50 0.900000±n/a nM
Citation Skerlj, RBridger, GZhou, YBourque, EMcEachern, EMetz, MHarwig, CLi, TSYang, WBogucki, DZhu, YLangille, JVeale, DBa, TBey, MBaird, IKaller, AKrumpak, MLeitch, DSatori, MVocadlo, KGuay, DNan, SYee, HCrawford, JChen, GWilson, TCarpenter, BGauthier, DMacfarland, RMosi, RBodart, VWong, RFricker, SSchols, D Design of substituted imidazolidinylpiperidinylbenzoic acids as chemokine receptor 5 antagonists: potent inhibitors of R5 HIV-1 replication. J Med Chem56:8049-65 (2013) 
 
C-C chemokine receptor type 5
Name:C-C chemokine receptor type 5
Type:Enzyme
Mol. Mass.:40540.21
Organism:Homo sapiens (Human)
Description:P51681
Residue:352
BDBM50441694
NameBDBM50441694
Synonyms:CHEMBL2435859
TypeSmall organic molecule
Emp. Form.C33H46ClN5O2
Mol. Mass.580.204
SMILESCC(CCNC(=O)c1c(C)cc(Cl)nc1C)N1CCC(CC1)N1[C@@H](CN(CC2CCCCC2)C1=O)c1ccccc1