Reaction Details
TargetSigma non-opioid intracellular receptor 1
LigandBDBM50441934
Substrate/Competitorn/a
Meas. Tech.ChEMBL_987953 (CHEMBL2438376)
Ki 2567±n/a nM
Citation Abate, CSelivanova, SVMüller, AKrämer, SDSchibli, RMarottoli, RPerrone, RBerardi, FNiso, MAmetamey, SM Development of 3,4-dihydroisoquinolin-1(2H)-one derivatives for the Positron Emission Tomography (PET) imaging ofs2 receptors. Eur J Med Chem69:920-30 (2013) 
 
Sigma non-opioid intracellular receptor 1
Name:Sigma non-opioid intracellular receptor 1
Type:Protein
Mol. Mass.:25307.17
Organism:Cavia porcellus (Guinea pig)
Description:Q60492
Residue:223
BDBM50441934
NameBDBM50441934
Synonyms:CHEMBL2437382
TypeSmall organic molecule
Emp. Form.C25H32N2O5
Mol. Mass.440.532
SMILESCOc1cc2CCN(CCCN3CCc4cc(OC)c(OC)cc4C3=O)Cc2cc1OC