Reaction Details
TargetNeuropeptide Y receptor type 5
LigandBDBM50441953
Substrate/Competitorn/a
Meas. Tech.ChEMBL_992052 (CHEMBL2447453)
Ki>500±n/a nM
Citation Berlicki, LKaske, MGutièrrez-Abad, RBernhardt, GIlla, OOrtuno, RMCabrele, CBuschauer, AReiser, O Replacement of Thr32 and Gln34 in the C-terminal neuropeptide Y fragment 25-36 by cis-cyclobutane and cis-cyclopentane β-amino acids shifts selectivity toward the Y(4) receptor. J Med Chem56:8422-31 (2013) 
 
Neuropeptide Y receptor type 5
Name:Neuropeptide Y receptor type 5
Type:Enzyme
Mol. Mass.:50746.64
Organism:Homo sapiens (Human)
Description:Q15761
Residue:445
BDBM50441953
NameBDBM50441953
Synonyms:CHEMBL2440187
TypeSmall organic molecule
Emp. Form.C76H121N25O17
Mol. Mass.1656.9312
SMILESCC[C@H](C)[C@H](NC(=O)[C@H](Cc1ccc(O)cc1)NC(=O)[C@H](Cc1cnc[nH]1)NC(=O)[C@H](CCCN=C(N)N)NC(C)=O)C(=O)N[C@@H](CC(N)=O)C(=O)N[C@@H](CC(C)C)C(=O)N[C@@H]([C@@H](C)CC)C(=O)N[C@@H]([C@@H](C)O)C(=O)N[C@@H](CCCN=C(N)N)C(=O)N[C@H]1CCC[C@H]1C(=O)N[C@@H](CCCN=C(N)N)C(=O)N[C@@H](Cc1ccc(O)cc1)C(N)=O